VAERS_ID,S_DATE,STATE,AGE_YRS,SEX,RPT_DATE,SYMPTOM_TEXT,SYM_CNT,SYM01,SYM02,SYM03,SYM04,SYM05,SYM06,SYM07,SYM08,SYM09,SYM10,SYM11,SYM12,SYM13,SYM14,SYM15,SYM16,SYM17,SYM18,SYM19,SYM20,DIED,DATEDIED,L_THREAT,ER_VISIT,HOSPITAL,HOSPDAYS,X_STAY,DISABLE,RECOVD,VAX_DATE,ONSET_DATE,NUMDAYS,LAB_DATA,VAX_CNT,VAX1,VAX2,VAX3,VAX4,VAX5,VAX6,VAX7,VAX8,V_ADMINBY,V_FUNDBY,OTHER_MEDS,CUR_ILL,HISTORY,PRIOR_VAX
025001,07/05/1990,WI,0.2,F,,"Loud intense cry with screaming for 1 1/2 hrs.  Seen next day, child  normal.",1,AGITATION,,,,,,,,,,,,,,,,,,,,,,,,,,,,U,06/04/1990,06/04/1990,0,,1,DTP,,,,,,,,PVT,UNK,,,,
025003,07/05/1990,TX,0.8,M,,"Hypotonic, Hyporesponsive episode, Infant died: Reyes text Syndrome.  Vaccine given for routine immunizations.",3,BRAIN SYND ACUTE,HYPOKINESIA,HYPOTONIA,,,,,,,,,,,,,,,,,,Y,,,,,,,,N,01/29/1990,02/04/1990,6,,2,DTP,OPV,,,,,,,UNK,UNK,,,,
025004,07/05/1990,NY,0.9,M,,"Pt developed chills for approx. 1 hr, felt achy all over, genital area turned red with some swelling, no pain 24 hrs later, now has pain in genital area. Genitals pain, swelling, redness for 8 days. Fever, dematitis contact, rigors",4,CHILLS,DERM CONTACT,EDEMA GENITAL,PAIN PELVIC,,,,,,,,,,,,,,,,,,,,,,,,,U,11/13/1989,11/13/1989,0,,1,OPV,,,,,,,,UNK,UNK,,,,
025005,07/05/1990,OK,,U,,"7 patients within 2 weeks have reported joint pain & tenderness which radiated up to the shoulder, redness & slight swelling @ injection site, no treatment prescribed, 1 patient is due to visit a neurologist for shoulder. Vaccines routine",3,ARTHRITIS,EDEMA INJECT SITE,INJECT SITE REACT,,,,,,,,,,,,,,,,,,,,,,,,,,,,,,,1,TD,,,,,,,,UNK,UNK,,,,
025006,07/05/1990,OH,16.7,F,,16 yr old female feeling faint & then had seizure within a few min. /p Td/MMR immunization.  MD is uncertain if seizure was due to hyperventilation episode. No treatment initiated. Pt asymptomatic. Vaccine given routine,2,CONVULS,DIZZINESS,,,,,,,,,,,,,,,,,,,,,,,,,,,Y,11/17/1989,11/17/1989,0,,2,MMR,TD,,,,,,,UNK,UNK,,,no hx of local or systemic rxns,
025007,07/05/1990,OR,39.0,U,,2 or 3 patients who received immunization & developed swollen red arm.,2,INFLAM INJECT SITE,INJECT SITE REACT,,,,,,,,,,,,,,,,,,,,,,,,,,,,,,,,1,TD,,,,,,,,OTH,OTH,,,,
025008,07/05/1990,,75.5,F,,"Pt developed an inject site rxn. Aea was erthematous, hard & warm to touch several days /p immunization, treated  w/ Benadryl.",2,INFLAM INJECT SITE,INJECT SITE REACT,,,,,,,,,,,,,,,,,,,,,,,,,,,U,07/05/1989,,,,1,TD,,,,,,,,PVT,UNK,,,,
025015,07/05/1990,GA,,U,,"vaccine contained large amount of sediment which will not resuspend.  Also, reporter states that he has not seen an increase in the number of reactions; however, he has noted more severity of local rxns, more than nl temp and knot under skn",2,FEVER,MASS INJECT SITE,,,,,,,,,,,,,,,,,,,,,,,,,,,,11/01/1989,11/01/1989,0,n/a,1,DTP,,,,,,,,UNK,UNK,,,,
025087,07/09/1990,CA,,F,,"5 pts experienced fever,chills,nausea,vomiting within 48 hrs after immunization. All pts received immun from same vial between 6-1-90 and 6-15-90.One pt treated with tylenol and compazine.",4,CHILLS,FEVER,NAUSEA,VOMIT,,,,,,,,,,,,,,,,,,,,,,,,,,,,,N/A,1,TD,,,,,,,,PVT,PVT,,,,
025088,07/09/1990,CA,,F,,"5 PTS EXPERIENCED FEVER,CHILLS,NAUSEA,AND VOMITING WITHIN 48 HRS AFTER IMMUNIZATION.ALL PTS RECEIVED IMMUN FROM SAME VIAL BETWEEN 6-1-89 AND 6-15-89. ONE PT TREATED WITH TYLENOL AND COMPAZINE",4,CHILLS,FEVER,NAUSEA,VOMIT,,,,,,,,,,,,,,,,,,,,,,,,,,,,,,1,TD,,,,,,,,PVT,PVT,,,,
025089,07/09/1990,CA,,F,,"5 PTS EXPERIENCED FEVER, CHILLS, NAUSEA, VOMITING 48 HRS AFTER IMMUNIZATION.ALLPTS RECEIVED IMMUN FROM SAME VIAL BETWEEN 6-1-89 AND 6-15-89.ONE PT TREATED WITH TYLENOL AND COMPAZINE.",4,CHILLS,FEVER,NAUSEA,VOMIT,,,,,,,,,,,,,,,,,,,,,,,,,,,,,,1,TD,,,,,,,,PVT,PVT,,,,
025090,07/09/1990,CA,,F,,"5 PTS EXPERIENCED FEVER,CHILLS,NAUSEA AND VOMITING WITHIN 48 HRS AFTER IMMUNIZATION. ALL PTS RECEIVED IMMUN FROM SAME VIAL BETWEEN 6-1-89 AND 6-15-89.ONE PT TREATED WITH TYLENOL AND COMPAZINE",4,CHILLS,FEVER,NAUSEA,VOMIT,,,,,,,,,,,,,,,,,,,,,,,,,,,,,,1,TD,,,,,,,,PVT,PVT,,,,
025091,07/09/1990,NY,2.0,U,,"pt nearly fainted-no loc,sweating, bp dropped aprox 5-10 min after vac.",3,DIZZINESS,HYPOTENS,SWEAT,,,,,,,,,,,,,,,,,,,,,,,,,,,,,,,1,TD,,,,,,,,PVT,PVT,,,,
025092,07/09/1990,NY,10.0,U,,"Pt nearly fainted - no loss of consciousness, sweating and blood pressure dropped approximately 5-10 minutes after vaccination.",3,DIZZINESS,HYPOTENS,SWEAT,,,,,,,,,,,,,,,,,,,,,,,,,,,,,,,1,TD,,,,,,,,PVT,UNK,,,,
025093,07/09/1990,TX,14.0,F,,"Pt recvd TD Booster on 17-ARP-89, after stepping on a nail, returned to office on 19-APR-89, complaining of temp 99.5, pain at site of injection, radiating upper arm to neck; had swelling, redness, tenderness at site of injection.",4,EDEMA INJECT SITE,FEVER,INJECT SITE REACT,PAIN INJECT SITE,,,,,,,,,,,,,,,,,,,,,,,,,,04/17/1989,04/17/1989,0,,1,TD,,,,,,,,UNK,UNK,,,,
025094,07/09/1990,CA,,U,,One of five patients who experienced swelling of injection site and fever (1-3 days) after immunization.,2,EDEMA INJECT SITE,FEVER,,,,,,,,,,,,,,,,,,,,,,,,,,,,,,,,1,TD,,,,,,,,PVT,UNK,,,,
025095,07/09/1990,CA,,U,,One of five pt who experienced swelling of injection site and fever (1-3 days) after immunization.,2,EDEMA INJECT SITE,FEVER,,,,,,,,,,,,,,,,,,,,,,,,,,,,,,,,1,TD,,,,,,,,PVT,UNK,,,,
025096,07/09/1990,CA,,U,,"Approximately 15 pt developed induration, swelling, redness and pain on the entire arm.",3,EDEMA INJECT SITE,INJECT SITE REACT,PAIN INJECT SITE,,,,,,,,,,,,,,,,,,,,,,,,,,,,,,,1,TD,,,,,,,,UNK,UNK,,,,
025097,07/09/1990,TX,,U,,"One of three healthy, young, adult pt who developed vasovagal syncopal episode within 5 minutes of immunization.  recovered uneventfully.",1,SYNCOPE,,,,,,,,,,,,,,,,,,,,,,,,,,,,,,,,,1,TD,,,,,,,,PVT,UNK,,,,
025098,07/09/1990,TX,,U,,"One of three healthy, young, adult pt who developed vasovagal syncopal episode within 5 minutes of immunization.  Recovered uneventfully.",1,SYNCOPE,,,,,,,,,,,,,,,,,,,,,,,,,,,,,,,,,1,TD,,,,,,,,PVT,UNK,,,,
025099,07/09/1990,TX,,U,,"One of three healthy, young, adult pt who developed vasobagal syncopal episode within 5 minutes of immunization.  Recovered uneventfully.",1,SYNCOPE,,,,,,,,,,,,,,,,,,,,,,,,,,,,,,,,,1,TD,,,,,,,,PVT,UNK,,,,
025100,07/09/1990,TX,,U,,Pt fainted within 15 minutes after immunization.,1,SYNCOPE,,,,,,,,,,,,,,,,,,,,,,,,,,,,,,,,,1,TD,,,,,,,,PVT,UNK,,,,
025101,07/09/1990,TX,,U,,Pt fainted within 15 minutes after immunization.,1,SYNCOPE,,,,,,,,,,,,,,,,,,,,,,,,,,,,,,,,,1,TD,,,,,,,,PVT,UNK,,,,
025102,07/09/1990,NY,1.5,F,,"Plaintiffs allege that as a result of immunization in 1-DEC-81, healthy 20 month old suffered high fever & convulsions with resultant permanent paralysis of right extremities, mental retardation & behavioral problems.",5,CONVULS,FEVER,HEMIPLEGIA,MENTAL RETARD,PERSON DIS,,,,,,,,,,,,,,,,,,,,Y,,,Y,,12/09/1981,,,,1,DTP,,,,,,,,UNK,UNK,,,,
025103,07/09/1990,TX,15.0,M,,"4-APR-89 came in for TD Booster. Last booster had been given 1-MAR-79.  Returned to office 6-APR-89, complaining of pain, redness and swwelling at site of injection.  Also had fever up to 103.  Physician noted on chart modify next dose.",4,EDEMA INJECT SITE,FEVER,INJECT SITE REACT,PAIN INJECT SITE,,,,,,,,,,,,,,,,,,,,,,,,,,,04/04/1989,,,1,TD,,,,,,,,PVT,UNK,,,,
025104,07/09/1990,NE,0.7,F,,"Child given DTP on 11-DEC-89.  Four Hrs later at home turned pale, eyes rolled back, became limp, bumped chin on high chair.  No seizure activity.  Examined in office; temp 102, otherwise fine.  Child hospitalized and place on monitor.",3,EYES GAZE UPWARD,HYPOTONIA,INJURY ACCID,,,,,,,,,,,,,,,,,,,,,,Y,,,,,,,,,1,DTP,,,,,,,,UNK,UNK,,,,
025105,07/09/1990,CO,7.0,F,,7 1/2 year old child had reaction (symptoms unspecified),1,REACT UNEVAL,,,,,,,,,,,,,,,,,,,,,,,,,,,,,,,,,1,DTP,,,,,,,,UNK,UNK,,,,
025106,07/09/1990,NY,0.6,M,,"7 month old infant received 3rd immunization and 1 hr later developed shaking movements of extremities, and lips turned blue for a duration of approximately 30 minutes, then alert and active.  Neuro exam significant for tendency lt hand.",3,CONVULS,CYANOSIS,TWITCH,,,,,,,,,,,,,,,,,,,,,,,,,,,12/06/1989,12/07/1989,1,"CSF - WBC = 0, RBC=5, CSF Protein=13, Glucose 71/94, SMA-7WNL",1,DTP,,,,,,,,PVT,UNK,,,,
025107,07/09/1990,MD,0.4,F,,Fever 104 and screaming episode lasting appproximately 3 hrs following DTP/OPV immunization.,2,FEVER,SCREAMING SYND,,,,,,,,,,,,,,,,,,,,,,,,,,,,11/28/1989,11/28/1989,0,,2,DTP,OPV,,,,,,,UNK,UNK,,,,
025108,07/09/1990,DE,0.3,F,,4 Month old infant developed injection site reactionwithin 24 hrs after DTP/OPV immunization.,1,INJECT SITE REACT,,,,,,,,,,,,,,,,,,,,,,,,,,,,,,10/01/1989,,,2,DTP,OPV,,,,,,,UNK,UNK,,,,
025109,07/09/1990,TX,0.6,U,,7 Month old infant developed fever to 104 following DTP/Measles Immunization.,1,FEVER,,,,,,,,,,,,,,,,,,,,,,,,,,,,,,,,,1,DTP,,,,,,,,PVT,UNK,,,,
025110,07/09/1990,NC,0.1,F,,"2 Months old infant appeared sluggish, in a deep sleep and required stimulation for 20-25 minutes.  Event occured 1 1/2 - 2 hrs after DTP/OPV immunization.",1,SOMNOLENCE,,,,,,,,,,,,,,,,,,,,,,,,,,,,,12/06/1989,12/06/1989,0,,2,DTP,OPV,,,,,,,PVT,UNK,,,,
025111,07/09/1990,MD,0.4,F,,6month old infant developed fever 103 and screaming episode for approximately 3 hrs following DTP/OPV immuniation,2,FEVER,SCREAMING SYND,,,,,,,,,,,,,,,,,,,,,,,,,,,,10/03/1989,10/03/1989,0,,2,DTP,OPV,,,,,,,UNK,UNK,,,,
025112,07/09/1990,TN,0.2,M,,"Child presented in office same evening following immunization with splotchy erythema on entire leg, swelling 2 cm & irritability; crying episode (2PM to 2AM).. Treates w/Tempra and cold compresses.  child had a low grade fever of 99 at imm.",3,EDEMA INJECT SITE,RASH,SCREAMING SYND,,,,,,,,,,,,,,,,,,,,,,,,,,,01/04/1990,01/04/1990,0,,1,DTP,,,,,,,,UNK,UNK,,,,
025113,07/09/1990,TX,,U,,"One of three pt who developed an area that was pruritic and hot to touch, involving the entire upper arm around the injection site.",2,HYSN INJECT SITE,INFLAM INJECT SITE,,,,,,,,,,,,,,,,,,,,,,,,,,,,,,,,1,TD,,,,,,,,UNK,UNK,,,,
025114,07/09/1990,TX,,U,,"One of three pt who developed an area that was pruritic and hot to touch, involving the entire upper arm around the injection site.",2,HYSN INJECT SITE,INFLAM INJECT SITE,,,,,,,,,,,,,,,,,,,,,,,,,,,,,,,,1,TD,,,,,,,,PVT,UNK,,,,
025115,07/09/1990,TX,10.0,F,,"Received TD 24-APR-89 Booster after getting laceration to toe.  Last TD was 26-APR-84.  Returned to office 25-APR-89 c/o pain and swelling at injection site, sore throat, headache, stomach ache and fever up to 101.2.  Treated w/warm soaks",4,EDEMA INJECT SITE,FEVER,INFECT,PAIN INJECT SITE,,,,,,,,,,,,,,,,,,,,,,,,,,04/24/1989,04/24/1989,0,,1,TD,,,,,,,,PVT,UNK,,,,
025116,07/09/1990,CO,14.0,M,,"12 hrs after immunization pt developed severe headache, nausea vomiting.  Lasted 24 hrs only.",3,HEADACHE,NAUSEA,VOMIT,,,,,,,,,,,,,,,,,,,,,,,,,,,03/01/1989,03/01/1989,0,,1,TD,,,,,,,,PVT,UNK,,,,
025117,07/09/1990,TX,,U,,"One of three pt who developed an area that was pruritic and hot to touch, involving the entire upper arm around the injection site.",2,HYSN INJECT SITE,INFLAM INJECT SITE,,,,,,,,,,,,,,,,,,,,,,,,,,,,,,,,1,TD,,,,,,,,PVT,UNK,,,,
025118,07/09/1990,CO,,U,,"One of five pt with pain upon injection, and injection site erythema and/or pain and/or swelling following immunization.",3,EDEMA INJECT SITE,INJECT SITE REACT,PAIN INJECT SITE,,,,,,,,,,,,,,,,,,,,,,,,,,,,,,,1,TD,,,,,,,,PVT,UNK,,,,
025119,07/09/1990,CO,,U,,"One of five pt with pain upon injection, and injection site erythema and/or pain and/or swelling following immunization.",3,EDEMA INJECT SITE,INJECT SITE REACT,PAIN INJECT SITE,,,,,,,,,,,,,,,,,,,,,,,,,,,,,,,1,TD,,,,,,,,PVT,UNK,,,,
025120,07/09/1990,CO,,U,,"One of five pt with pain upon injection, and injection site erythema and/or pain and/or swelling following immunization.",3,EDEMA INJECT SITE,INJECT SITE REACT,PAIN INJECT SITE,,,,,,,,,,,,,,,,,,,,,,,,,,,,,,,1,TD,,,,,,,,PVT,UNK,,,,
025122,07/09/1990,UT,,U,,"One of three pt who experienced a burning sensation upon injection and had an injection site reaction (red, painful) following immunization.",2,INJECT SITE REACT,PAIN INJECT SITE,,,,,,,,,,,,,,,,,,,,,,,,,,,,,,,,1,TD,,,,,,,,PVT,UNK,,,,
025132,07/09/1990,DC,0.2,M,,BRIEF GENERALIZED SEIZURE AFTER DTP AND ORAL POLIO VACCINE #1. SPONTANEOUS RECOVERY. PT PRESENTLY WELL.,1,CONVULS,,,,,,,,,,,,,,,,,,,,,,,,,,,,Y,06/22/1990,06/22/1990,0,,2,DTP,OPV,,,,,,,PVT,PVT,ORAL POLIO VACCINE GIVEN SIMULTANEOUSLY,,,
025133,07/09/1990,TX,50.0,F,,SEVERE BACK PAIN & SEVERE HEMATURIA RESULTED WITHIN 2 DAYS /P 1ST DOSE OF HBV-VACCINE GIVEN OF 2MAR90. 2ND INJECT GIVEN ON 8MAY90. WITHIN 2 DAYS PT C/O BACK PAIN AND HEMATURIA. PHYSICIAN FELT SYMPTOMS FROM VACCINE.,2,HEMATURIA,PAIN BACK,,,,,,,,,,,,,,,,,,,,,,,Y,,Y,,U,03/02/1990,04/04/1990,33,,1,HEP,,,,,,,,PVT,PVT,,,NO PREVIOUS KIDNEY PROBLEMS,
025134,07/09/1990,CA,0.2,M,,SCREAMED 8 DAYS AFTER DPT/OPV GIVEN 4-24-90. NORMAL NOW.,1,SCREAMING SYND,,,,,,,,,,,,,,,,,,,,,,,,,,,,Y,04/24/1990,04/24/1990,0,,2,DTP,OPV,,,,,,,PVT,PVT,,,,
025135,07/09/1990,TX,1.1,M,,"1 HR AFTER PT RECEIVED 1ST DTP/OPV HAD SHAKING OF HANDS/FEET WITH DECREASED ALERTNESS,BLUE LIPS,HANDS/FEET LASTING 5-8 MIN. FEVER 103.9 UPON EXAM.PURULENT NASORHINITIS AND FUSSINESS.",5,AGITATION,CONVULS,CYANOSIS,FEVER,RHINITIS,,,,,,,,,,,,,,,,,,,,,,,,,11/30/1989,11/30/1989,0,"WBC=36 (51 S,11 L,1 MONO,4 BANDS) HG=11.3,HCT=32.1,MCV=81 HEART RATE 156, RESP RATE 40",2,DTP,OPV,,,,,,,PVT,PVT,TYLENOL,,,
025136,07/09/1990,CA,1.5,F,,PT HAD HIGH FEVER (105 F). BRIEF GENERALIZED SIEZURE,2,CONVULS,FEVER,,,,,,,,,,,,,,,,,,,,,,,,,,,,11/03/1989,11/03/1989,0,,3,DT,MMR,OPV,,,,,,PVT,PVT,,,,
025137,07/09/1990,VA,5.0,F,,"PT HAD INTERMITTENT BRADYCARDIA, LOW BP AND ALTERED CONSCIOUSNESS.",3,BRADYCARDIA,HYPOTENS,STUPOR,,,,,,,,,,,,,,,,,,,,,,Y,,,,,05/28/1990,05/28/1990,0,,3,DTP,MMR,OPV,,,,,,PVT,UNK,,,,
025138,07/09/1990,WV,0.1,F,,INFANT RECEIVED 2ND DTP/OPV IMMUN 10-16-89. WITHIN 24 HOURS AFTER IMMUN PT EXPERIENCED BLOODY DIARRHEA LASTING 2 DAYS.PT EXPERIENCED SIMILAR EPISODE AFTER FIRST DTP/OPV IMMUN ON 8-18-89. RECHALLENGED,1,DIARRHEA BLOODY,,,,,,,,,,,,,,,,,,,,,,,,,,,,,10/16/1989,10/16/1989,0,,1,DT,,,,,,,,PVT,PVT,"TRI-IMMUNOL, ORIMUNE",,,
025139,07/09/1990,IA,0.2,F,,PT IMMUNIZED AT 10:30 AM AND AT 9:00PM PRESENTED IN ER. PARENTS REPORTED 6 TO 10 SEIZURES WHICH STARTED AT 7:30 PM. PT'S EYES ROLLED BACKWARDS BECAME STIFF AND TURNED BLUE.,4,CONVULS,CYANOSIS,EYES GAZE UPWARD,HYPERTONIA,,,,,,,,,,,,,,,,,,,,,,,,,,10/11/1989,10/11/1989,0,,2,DT,DTP,,,,,,,PVT,PVT,,,,
025140,07/09/1990,IL,0.0,F,,"PT CRANKY NEXT 48 HRS AFTER IMMUN. BECAME LIMP AFTER 48 HRS. 3 EPISODES IN 3-4 HRS;MOTHER THOUGHT PT STOPPED BREATHING-NO COLOR CHANGE, NO SEIZURES, HOSPITALIZED-ABNORMAL PNEUMOGRAM. PT IMPROVED",4,AGITATION,APNEA,HYPOTENS,HYPOTONIA,,,,,,,,,,,,,,,,,,,,,Y,,,,Y,10/11/1989,10/11/1989,0,,1,DTP,,,,,,,,PVT,PVT,,,,
025141,07/09/1990,NC,0.1,U,,PT DEVELOPED SOME SHAKINT FOLLOWING IMMUN.CHILD HAD HIGH FEVER-OTHERWISE OK. VIAL CONTAINED SEDIMENT.,2,FEVER,TREMOR,,,,,,,,,,,,,,,,,,,,,,,,,,,,,,,,1,DTP,,,,,,,,PVT,PVT,,,,
025157,07/09/1990,MD,0.6,M,,"ONE OF 3 PTS WHO EXPERIENCED AND INJECTION SITE REACTION(I.E. ERYTHEMA,SWELLING,TENDERNESS AND HOT TO TOUCH)WITHIN 24 HRS AFTER IMMUN. UNABLE TO WALK DUE TO REACTION,TREATED WITH TYLENOL AND ICE PACKS AT SITE OF INJECTION.",2,INFLAM INJECT SITE,INJECT SITE REACT,,,,,,,,,,,,,,,,,,,,,,,,,,,,11/12/1989,11/12/1989,0,,1,DTP,,,,,,,,PVT,PVT,,,,
025161,07/09/1990,NY,0.1,U,,PT RECEIVED 3RD IMMUN 1-7-90.AFTER 48 HRS HAD 101-102 FEVER;FEVER GONE 1-12-90.HALF OF INFANTS FACE NOT MOVING(POSS.BELL'S PALSY) REFERRED TO NEUROLOGIST.,2,FEVER,PARALYSIS FACIAL,,,,,,,,,,,,,,,,,,,,,,,,,,,,,,,NEUROLOGY REPORT REQUESTED,1,DTP,,,,,,,,PVT,PVT,AMOXIL 125 MG FOR 10 DAYS,,,
025162,07/09/1990,MD,2.0,M,,"FEVER TO 105, PAIN IN JOINTS AND VOMITING LASTIN 3 DAYS AFTER RECEIVING DTP/OPV/HIB-V(CONNAUGHT) IMMUNIZATION.",3,ARTHRALGIA,FEVER,VOMIT,,,,,,,,,,,,,,,,,,,,,,,,,,,10/18/1989,10/18/1989,0,,3,DTP,HIBV,OPV,,,,,,PVT,PVT,,,,
025163,07/09/1990,IL,0.0,M,,"PT APPEARED LETHARGIC APPROX. 8 HRS AFTER DTP/OPV IMMUN, CHILD HAD SEVERE LETHARGY AND GAGGING EPISODES AND WAS HOSP. FOR OBSERVATION",2,SOMNOLENCE,VOMIT,,,,,,,,,,,,,,,,,,,,,,,Y,,,,,01/03/1990,01/03/1990,0,,2,DTP,OPV,,,,,,,PVT,PVT,,,,
025164,07/09/1990,PA,0.0,F,,PT IMMUNIZED 1-4-90.1-10-90 PT EXPERIENCED JERKING MOVEMENTS INTERMITTENTLY FOR 18 HRS.HIGH PITCHED CRY FOR 24 HRS.TYLENOL GIVEN FOR LOW GRADE FEVER.OFFICE VISIT 1-10AND1-15;INFANT RECOVERED,3,FEVER,SCREAMING SYND,TWITCH,,,,,,,,,,,,,,,,,,,,,,,,,,Y,01/04/1990,01/10/1990,6,,1,DTP,,,,,,,,PVT,PVT,,,,
025165,07/09/1990,NJ,59.0,F,,"PT ADMINISTERED TETANUS TOXOID ADSORBED IN LEFT BRACHIUM FOR TREAT OF LACERATED FINGER.AREA BECAME RED, PAINFUL. PAIN HAS PERSISTED ON MOVEMENT OF ARM.TREATED 9-29-89 WITH XYLOCAINE 2%PLUS DECADRON INTO TRIGGER POINT",2,INJECT SITE REACT,PAIN INJECT SITE,,,,,,,,,,,,,,,,,,,,,,,,,,,,09/28/1989,05/29/1989,-122,,1,TTOX,,,,,,,,PVT,PVT,"CIPROFLOXACIN 500 MG, BID #20",,,
025166,07/09/1990,CA,18.0,F,,"PT DEVELOPED A 1 CM AREA OF ERYTHEMA AND EDEMA,(POSS STERILE ABSCESS) WHICH PERSISTED 4 WEEKS FOLLOWING INJECT. OF TETANUS AND DIPHTHERIA TOXOIDS ADS.LESION WILL BE DRAINED BY FLANAGAN TO DETERMINE IF STERILE ABSCESS.",2,ABSCESS INJECT SITE,HYSN INJECT SITE,,,,,,,,,,,,,,,,,,,,,,,,,,,,03/23/1990,,,,1,TD,,,,,,,,PVT,PVT,,,,
025167,07/09/1990,NY,66.0,F,,"PT EXPERIENCED ITCHING AND EDEMA AT INJECTION SITE OF TETANUS TOXOID ADSORBED.4 MO LATER, PT DEVEL SWELLING AROUND EYES AND UPPER RESP. DIFFICULTIES ASSO. WITH FOOD. PT REPORTEDLY RECEIVED TETANUS INJECT ONLY 3 YEARS EARLIER.PT HOSPITALIZED",4,DYSPNEA,EDEMA FACE,EDEMA INJECT SITE,HYSN INJECT SITE,,,,,,,,,,,,,,,,,,,,,,,Y,,,01/01/1990,04/01/1990,90,,1,TTOX,,,,,,,,PVT,PVT,ace INHIBITOR UNSPECIFIED; NSAID - UNSPECIFIED,,HX OF HYPERTENSION,
025431,07/09/1990,IL,1.3,F,,"6 HRS AFTER VACCINE, FEVER AND SEIZURE(LEFT FOCAL SEIZURE)",2,CONVULS,FEVER,,,,,,,,,,,,,,,,,,,,,,,Y,,,,,06/05/1990,06/05/1990,0,"LUMBAR PUNCTURE NEGATIVE ,CTSCAN HEAD- NEGATIVE, UBC 4,300",1,MMR,,,,,,,,PVT,PVT,,,,
025009,07/10/1990,FL,3.3,M,,"15mon. male w/ hx of recurrent ear infections & measles in Feb. 89'. 5Apr89 was given MMR. Within 24 hrs /p vaccine, parents noted hearing deficit, confirmed by physician exam.",1,DEAF,,,,,,,,,,,,,,,,,,,,,,,,,,,Y,N,04/05/1990,04/06/1990,1,,1,MMR,,,,,,,,UNK,UNK,,,"recurrent otitis media, measles",
025012,07/10/1990,WI,0.2,M,,"3 days /p immun. infant only able to move fingers of left arm, no tone in arm. Immun. given in Right thigh/buttocks.  Mononeuropathy left upper extremity.",3,HYPOTONIA,MONOPLEGIA,NEUROPATHY,,,,,,,,,,,,,,,,,,,,,,,,,,U,10/20/1989,10/23/1989,3,"xrays of left shoulder, clavicle, humerus & forearm - WNL",2,DTP,OPV,,,,,,,UNK,UNK,,,,
025013,07/10/1990,ND,0.4,U,,"Pt received DTP/OPV vaccine developed rash in groin area, became wide spread, DX rash, erythema multiforme (E.R. report indicates due to OPV vaccine) At 6 mon. child received DTP w/ no problems.",2,ERYTHEMA MULT,RASH,,,,,,,,,,,,,,,,,,,,,,,,,,,Y,,,,,2,DTP,OPV,,,,,,,PVT,UNK,,,,
025014,07/10/1990,SC,0.4,U,,"4 month old infant received 2nd immunization & became very irritable, fussy & refused to eat.  w/ 1st imminization, infant was fussy for about 3 days.",2,AGITATION,ANOREXIA,,,,,,,,,,,,,,,,,,,,,,,,,,,Y,,,,,1,DTP,,,,,,,,PVT,UNK,,,,
025016,07/10/1990,GA,0.3,F,,"4 mon. infant given DTP 6Feb86- no problems until 9FEB86 awoke w/ fever 103F seen by MD normal exam. 18 hrs later generalized tonic-clonic seizure thought to be febrile, 2nd seizure 17Mar86, 3rd 3Apr86, child has developmental delay.",4,CONVULS GRAND MAL,EEG ABNORM,FEVER,MENTAL RETARD,,,,,,,,,,,,,,,,,,,,,,,,Y,N,02/09/1986,02/09/1986,0,"initially all lab data WNL; EEG normal, however over period 1986-1988 EEG has turned markedly abnormal, all lab studies WNL",1,DTP,,,,,,,,PVT,UNK,,,,
025017,07/10/1990,CO,35.0,F,,"pt deveolped cellulitis at injection site within 48 hrs p/ immun., mass was not drained or cultured, however is was fluctuant, seen in ER treated w/ with Cirpo & warm compresses, returned to ER for pain, asymptomatic on 4th day.",2,CELLULITIS,INJECT SITE REACT,,,,,,,,,,,,,,,,,,,,,,Y,,,,,Y,07/19/1989,07/21/1989,2,,1,TD,,,,,,,,PVT,UNK,,,,
025018,07/10/1990,KY,30.0,F,,"pt developed an injection site reaction resulting in a mass 4 cm in diameter, area was erythematous, warm to touch & firm, treated with Atarax, resolved",2,INFLAM INJECT SITE,MASS INJECT SITE,,,,,,,,,,,,,,,,,,,,,,,,,,,Y,07/07/1989,07/10/1989,3,,1,TD,,,,,,,,PVT,UNK,,,,
025019,07/10/1990,NC,0.8,M,,Received DTP on 8JUN90 & had prolonged fever for a week's time,1,FEVER,,,,,,,,,,,,,,,,,,,,,,,,,,,,,06/08/1990,06/08/1990,0,,1,DTP,,,,,,,,UNK,UNK,,,,
025020,07/10/1990,NY,4.5,F,,"Urticaria, wheezy, & periorbital edema which abated /p administration of subcut. epinephrine, Bendryl IV, Solumendrol IV",3,ASTHMA,EDEMA FACE,URTICARIA,,,,,,,,,,,,,,,,,,,,,,Y,,,,,06/14/1990,06/14/1990,0,,1,MMR,,,,,,,,PVT,UNK,"Subcut- Epinephrine, Bendryl & Solumedrol IV",,,
025021,07/10/1990,FL,32.0,F,,"/p receiving vaccine developed headache, sorejoints, chills, sternal chest pain, low grade fever, low blood pressure & low heart rate, chills again, relief lasted about 2-2.5 hrs.  I have not found the low B/P & HR documented.",5,ARTHRALGIA,BRADYCARDIA,CHILLS,FEVER,HYPOTENS,,,,,,,,,,,,,,,,,,,,,,,,U,06/08/1990,06/08/1990,0,,1,R,,,,,,,,UNK,UNK,,,,
025022,07/10/1990,MD,0.2,F,,"fever 102 F. local adenopathy, screaming episode & local reaction",4,AGITATION,FEVER,INJECT SITE REACT,LYMPHADENO,,,,,,,,,,,,,,,,,,,,,,,,,,04/26/1990,04/26/1990,0,,1,DTP,,,,,,,,PVT,UNK,,,,
025023,07/10/1990,PA,,M,,pt has URI prior to onset of Guillian-Barre symptoms. He has rheumatoid arthritis & was receiving gold therapy concurrently. He was given the flu vaccine on 23Oct89,1,GUILLAIN BARRE SYND,,,,,,,,,,,,,,,,,,,,,,,,,,,,U,10/23/1989,12/07/1989,45,,1,FLU,,,,,,,,UNK,UNK,receiving gold therapy for rhematiod arthritis,URI,rhematoid arthritis,
025024,07/10/1990,NH,,U,,Sore edema on arms massive redness from top of shoulder to elbows. More than the usual expected reaction. Just started using the DT two weeks ago.  All reactions during this period 6 out of 30 patients.,2,EDEMA,INJECT SITE REACT,,,,,,,,,,,,,,,,,,,,,,,,,,,,,,,,1,TD,,,,,,,,UNK,UNK,,,,
025025,07/10/1990,FL,,U,,"rash, pruritus",2,PRURITUS,RASH,,,,,,,,,,,,,,,,,,,,,,,,,,,Y,,01/10/1990,,,1,FLU,,,,,,,,UNK,UNK,treated with Hydroxazine,,,
025026,07/10/1990,WA,1.0,M,,child found dead in bed 14Jan90.  Had full check up 12Jan90 with immunizations DPT/HIB/Oral Polio,1,REACT UNEVAL,,,,,,,,,,,,,,,,,,,,Y,01/14/1990,,,,,,,N,01/12/1990,01/14/1990,2,,3,DT,HIBV,OPV,,,,,,UNK,UNK,,,,
025027,07/10/1990,NY,1.0,F,,"fever 102.5 F, rash",2,FEVER,RASH,,,,,,,,,,,,,,,,,,,,,,,,,,,U,05/29/1990,05/31/1990,2,,1,MMR,,,,,,,,UNK,UNK,,,,
025028,07/10/1990,TN,2.0,M,,Pt admitted with H-Flu meningitis on 24Jun90. Pt expired on 25Jun90. Pt received HIB vaccine at 18 months of age.,1,MENINGITIS,,,,,,,,,,,,,,,,,,,,Y,06/25/1990,,,,,,,N,05/24/1989,06/24/1990,396,,1,HIBV,,,,,,,,UNK,UNK,,,,
025029,07/10/1990,FL,0.5,F,,p/ receiving DPT #2 infant developed fever 103.4 for 4 days and extreme lethargy,2,FEVER,SOMNOLENCE,,,,,,,,,,,,,,,,,,,,,,,,,,,,,04/02/1990,,,1,DTP,,,,,,,,PVT,UNK,,,,
025030,07/10/1990,NY,66.0,F,,Mylagias occurred within 3 days of immun. Seen on 4 additional occasions for continued pain & increasing eye/temporal pain.  Considered poss. meningoencephalitis due to vaccine. Admit to hosp for Guillain-Barre Synd. on 15Feb90.,3,ENCEPHALITIS,GUILLAIN BARRE SYND,MYALGIA,,,,,,,,,,,,,,,,,,,,,,Y,,,,U,12/01/1989,12/03/1989,2,,1,FLU,,,,,,,,UNK,UNK,"Lisinopril 20mg, Verapamil 120mg, HCTZ 25mg, Thyrolar",,,
025031,07/10/1990,,,U,,rash skin on legs,1,RASH,,,,,,,,,,,,,,,,,,,,,,,,,,,,U,,,,,1,HEP,,,,,,,,UNK,UNK,,,,
025036,07/10/1990,MD,1.5,F,,Within 5-10 of injection pt pased out/fainted temp 100.8,2,FEVER,SYNCOPE,,,,,,,,,,,,,,,,,,,,,,,,,,,Y,,06/29/1990,,,1,HIBV,,,,,,,,PVT,UNK,,,,